Target
Retinoic acid receptor RXR-alpha
Ligand
BDBM276363
Substrate
Meas. Tech.
NR2B standard assay
pH
7.4±n/a
Temperature
298.15±n/a K
IC50
2.00±n/a nM
Comments
extracted
Citation
 Chen, GChrovian, CCCoate, HRDvorak, CAGelin, CFHiscox, ALetavic, MARech, JCSoyode-Johnson, AStenne, BWall, JLZhang, W Substituted 1,2,3-triazoles as NR2B-selective NMDA modulators US Patent  US10071988 Publication Date 9/11/2018 
Target
Name:
Retinoic acid receptor RXR-alpha
Synonyms:
NR2B1 Nuclear receptor subfamily 4 group A member 2 RXRA Retinoic acid receptor RXR-alpha/gamma Retinoid receptor
Type:
PROTEIN
Mol. Mass.:
50820.38
Organism:
Homo sapiens (Human)
Description:
ChEMBL_1456363
Residue:
462
  
Inhibitor
Name:
BDBM276363
Synonyms:
2-[[1-[3-(1,1-Difluoroethyl)phenyl]triazol-4-yl]methoxy]-5- US10233173, Example 302
Type:
Small organic molecule
Emp. Form.:
C16H13F4N5O
Mol. Mass.:
367.3009
SMILES:
CC(F)(F)c1cccc(c1)-n1cc(COc2ncc(cn2)C(F)F)nn1
: