Target
Cannabinoid receptor 1
Ligand
BDBM84888
Substrate
Ki
2.3±n/a nM
Comments
PDSP_1071
Citation
 Breivogel, CSChilders, SR Cannabinoid agonist signal transduction in rat brain: comparison of cannabinoid agonists in receptor binding, G-protein activation, and adenylyl cyclase inhibition. J Pharmacol Exp Ther 295:328-36 (2000) Target
Name:
Cannabinoid receptor 1
Synonyms:
Brain-type cannabinoid receptor CB-R CNR1_RAT Cannabinoid receptor Cnr1 | Skr6
Type:
G Protein-Coupled Receptor (GPCR)
Mol. Mass.:
52856.55
Organism:
Rattus norvegicus (rat)
Description:
P20272
Residue:
473
  
Inhibitor
Name:
BDBM84888
Synonyms:
CAS_107822 Levonantradol NSC_51016 l-Nantradol
Type:
Small organic molecule
Emp. Form.:
C27H35NO4
Mol. Mass.:
437.5711
SMILES:
CC(CCCc1ccccc1)Oc1cc2NC(C)C3CCC(O)CC3c2c(OC(C)=O)c1
: