Target
Gamma-aminobutyric acid receptor subunit alpha-6
Ligand
BDBM50045050
Substrate
Ki
51±n/a nM
Comments
PDSP_264
Citation
 Vanover, KERosenzweig-Lipson, SHawkinson, JELan, NCBelluzzi, JDStein, LBarrett, JEWood, PLCarter, RB Characterization of the anxiolytic properties of a novel neuroactive steroid, Co 2-6749 (GMA-839; WAY-141839; 3alpha, 21-dihydroxy-3beta-trifluoromethyl-19-nor-5beta-pregnan-20-one), a selective modulator of gamma-aminobutyric acid(A) receptors. J Pharmacol Exp Ther 295:337-45 (2000) Target
Name:
Gamma-aminobutyric acid receptor subunit alpha-6
Synonyms:
GABA A Alpha6Beta3Gamma2 GABA receptor alpha-6 subunit Gabra-6 Gamma-aminobutyric acid receptor subunit alpha-6
Type:
Enzyme Catalytic Domain
Mol. Mass.:
51188.24
Organism:
RAT
Description:
GABA A Alpha6Beta2Gamma2 0 RAT::P30191
Residue:
453
  
Inhibitor
Name:
BDBM50045050
Synonyms:
1-(3-Hydroxy-10,13-dimethyl-hexadecahydro-cyclopenta[a]phenanthren-17-yl)-ethanone CHEMBL435035
Type:
Small organic molecule
Emp. Form.:
C21H34O2
Mol. Mass.:
318.4935
SMILES:
CC(=O)C1CCC2C3CC[C@H]4C[C@H](O)CC[C@]4(C)C3CC[C@]12C
: