Target
Leukotriene B4 receptor 1
Ligand
BDBM85694
Substrate
Ki
>10000±n/a nM
Comments
PDSP_1113
Citation
 Wang, SGustafson, EPang, LQiao, XBehan, JMaguire, MBayne, MLaz, T A novel hepatointestinal leukotriene B4 receptor. Cloning and functional characterization. J Biol Chem 275:40686-94 (2000)  
Target
Name:
Leukotriene B4 receptor 1
Synonyms:
BLT BLTR Chemoattractant receptor-like 1 GPR16 LTB4-R 1 Leukotriene B4 R1 Leukotriene B4 receptor 1 P2Y purinoceptor 7 | P2Y7
Type:
Enzyme Catalytic Domain
Mol. Mass.:
37582.68
Organism:
Homo sapiens (Human)
Description:
Q15722
Residue:
352
  
Inhibitor
Name:
BDBM85694
Synonyms:
LTD3
Type:
Small organic molecule
Emp. Form.:
C25H42N2O6S
Mol. Mass.:
498.676
SMILES:
CCCCCCCCC=CC=CC=CC(SCC(N)C(=O)NCC(O)=O)C(O)CCCC(O)=O
: