Target
Metabotropic glutamate receptor 1
Ligand
BDBM82355
Substrate
Ki
1200±n/a nM
Comments
PDSP_3205
Citation
 Mutel, VEllis, GJAdam, GChaboz, SNilly, AMesser, JBleuel, ZMetzler, VMalherbe, PSchlaeger, EJRoughley, BSFaull, RLRichards, JG Characterization of [(3)H]Quisqualate binding to recombinant rat metabotropic glutamate 1a and 5a receptors and to rat and human brain sections. J Neurochem 75:2590-601 (2000)  
Target
Name:
Metabotropic glutamate receptor 1
Synonyms:
GPRC1A GRM1_HUMAN Metabotropic Glutamate 1a | metabotropic glutamate 1
Type:
Enzyme
Mol. Mass.:
132358.19
Organism:
Homo sapiens (Human)
Description:
Q13255
Residue:
1194
  
Inhibitor
Name:
BDBM82355
Synonyms:
Amino-(3-hydroxy-isoxazol-5-yl)-acetic acid(Ibotenic acid) CHEMBL284895 Ibotenic acid | NSC_1233
Type:
Small organic molecule
Emp. Form.:
C5H6N2O4
Mol. Mass.:
158.1121
SMILES:
NC(C(O)=O)c1cc(=O)[nH]o1
: