Target
Gamma-aminobutyric acid type B receptor subunit 1
Ligand
BDBM50094703
Substrate
Ki
>10000±n/a nM
Comments
PDSP_2986
Citation
 Jarvis, MFYu, HKohlhaas, KAlexander, KLee, CHJiang, MBhagwat, SSWilliams, MKowaluk, EA ABT-702 (4-amino-5-(3-bromophenyl)-7-(6-morpholinopyridin-3-yl)pyrido[2, 3-d]pyrimidine), a novel orally effective adenosine kinase inhibitor with analgesic and anti-inflammatory properties: I. In vitro characterization and acute antinociceptive effects in the mouse. J Pharmacol Exp Ther 295:1156-64 (2000) Target
Name:
Gamma-aminobutyric acid type B receptor subunit 1
Synonyms:
GABA B GABA uptake GABA-B-R1 GABABR1 Gabbr1 | Gb1
Type:
Enzyme Catalytic Domain
Mol. Mass.:
111548.69
Organism:
Rattus norvegicus (Rat)
Description:
Q9Z0U4
Residue:
991
  
Inhibitor
Name:
BDBM50094703
Synonyms:
5-(3-Bromo-phenyl)-7-(6-morpholin-4-yl-pyridin-3-yl)-pyrido[2,3-d]pyrimidin-4-ylamine ABT-702 | CHEMBL66089
Type:
Small organic molecule
Emp. Form.:
C22H19BrN6O
Mol. Mass.:
463.33
SMILES:
Nc1ncnc2nc(cc(-c3cccc(Br)c3)c12)-c1ccc(nc1)N1CCOCC1
: