Target
Alpha-2C adrenergic receptor
Ligand
BDBM85709
Substrate
Ki
0.1585±n/a nM
Comments
PDSP_3303
Citation
 Millan, MJDekeyne, ANewman-Tancredi, ACussac, DAudinot, VMilligan, GDuqueyroix, DGirardon, SMullot, JBoutin, JANicolas, JPRenouard-Try, ALacoste, JMCordi, A S18616, a highly potent, spiroimidazoline agonist at alpha(2)-adrenoceptors: I. Receptor profile, antinociceptive and hypothermic actions in comparison with dexmedetomidine and clonidine. J Pharmacol Exp Ther 295:1192-205 (2000) Target
Name:
Alpha-2C adrenergic receptor
Synonyms:
ADA2C_RAT Adrenergic receptor alpha adrenergic Alpha2 | adrenergic Alpha2C
Type:
Enzyme Catalytic Domain
Mol. Mass.:
49890.50
Organism:
RAT
Description:
adrenergic Alpha2 0 RAT::P22086
Residue:
458
  
Inhibitor
Name:
BDBM85709
Synonyms:
S18616
Type:
Small organic molecule
Emp. Form.:
C12H14N2O
Mol. Mass.:
202.2524
SMILES:
NC1=NC2(CO1)CCc1ccccc1C2
: