Target
P2X purinoceptor 1
Ligand
BDBM85682
Substrate
Ki
1000±n/a nM
Comments
PDSP_3351
Citation
 Lambrecht, G Agonists and antagonists acting at P2X receptors: selectivity profiles and functional implications. Naunyn Schmiedebergs Arch Pharmacol 362:340-50 (2000)  
Target
Name:
P2X purinoceptor 1
Synonyms:
ATP receptor P2RX1_HUMAN Purinergic receptor | Purinergic, P2X
Type:
Enzyme Catalytic Domain
Mol. Mass.:
44992.65
Organism:
Homo sapiens (Human)
Description:
Purinergic, P2X 0 HUMAN::P51575
Residue:
399
  
Inhibitor
Name:
BDBM85682
Synonyms:
CAS_5311315 NSC_5311315
Type:
Small organic molecule
Emp. Form.:
C49H30N6O23S6
Mol. Mass.:
1263.182
SMILES:
[O-]S(=O)(=O)c1cc(c2c(NC(=O)c3ccc(NC(=O)c4ccc(NC(=O)Nc5ccc(cc5)C(=O)Nc5ccc(cc5)C(=O)Nc5ccc(c6cc(cc(c56)S([O-])(=O)=O)S([O-])(=O)=O)S([O-])(=O)=O)cc4)cc3)ccc(c2c1)S([O-])(=O)=O)S([O-])(=O)=O
: