Target
Metabotropic glutamate receptor 8
Ligand
BDBM82006
Substrate
Ki
>10000±n/a nM
Comments
PDSP_3211
Citation
 Naples, MAHampson, DR Pharmacological profiles of the metabotropic glutamate receptor ligands. Neuropharmacology 40:170-7 (2001)  
Target
Name:
Metabotropic glutamate receptor 8
Synonyms:
GRM8_RAT Grm8 Metabotropic glutamate receptor 8 (mGlu8) glutamate receptor, metabotropic 8 precursor metabotropic glutamate 8
Type:
Enzyme
Mol. Mass.:
101886.18
Organism:
Rattus norvegicus (Rat)
Description:
P70579
Residue:
908
  
Inhibitor
Name:
BDBM82006
Synonyms:
D-AP4 US9212196, L-AP4
Type:
Small organic molecule
Emp. Form.:
C4H10NO5P
Mol. Mass.:
183.0997
SMILES:
N[C@H](CCP(O)(O)=O)C(O)=O
: