Target
Metabotropic glutamate receptor 8
Ligand
BDBM17664
Substrate
Ki
1200±n/a nM
Comments
PDSP_3212
Citation
 Naples, MAHampson, DR Pharmacological profiles of the metabotropic glutamate receptor ligands. Neuropharmacology 40:170-7 (2001)  
Target
Name:
Metabotropic glutamate receptor 8
Synonyms:
GRM8_RAT Grm8 Metabotropic glutamate receptor 8 (mGlu8) glutamate receptor, metabotropic 8 precursor metabotropic glutamate 8
Type:
Enzyme
Mol. Mass.:
101886.18
Organism:
Rattus norvegicus (Rat)
Description:
P70579
Residue:
908
  
Inhibitor
Name:
BDBM17664
Synonyms:
(2S)-2-amino-3-(phosphonooxy)propanoic acid L-SOP | L-serine O-phosphate
Type:
Small organic molecule
Emp. Form.:
C3H8NO6P
Mol. Mass.:
185.0725
SMILES:
N[C@@H](COP(O)(O)=O)C(O)=O
: