Target
Mu-type opioid receptor
Ligand
BDBM85737
Substrate
Ki
1.69±n/a nM
Comments
PDSP_3253
Citation
 Schiller, PWNguyen, TMBerezowska, IDupuis, SWeltrowska, GChung, NNLemieux, C Synthesis and in vitro opioid activity profiles of DALDA analogues. Eur J Med Chem 35:895-901 (2000)  
Target
Name:
Mu-type opioid receptor
Synonyms:
M-OR-1 Mu opioid receptor OPIATE Mu OPRM_CAVPO
Type:
Enzyme Catalytic Domain
Mol. Mass.:
11165.58
Organism:
GUINEA PIG
Description:
P97266
Residue:
98
  
Inhibitor
Name:
BDBM85737
Synonyms:
CAS_122222 NSC_122222
Type:
Small organic molecule
Emp. Form.:
C30H45N9O5
Mol. Mass.:
611.7356
SMILES:
[#7]-[#6]-[#6]-[#6]-[#6]-[#6@H](-[#7]-[#6](=O)-[#6@H](-[#6]-c1ccccc1)-[#7]-[#6](=O)-[#6@@H](-[#6]-[#6]-[#6]\[#7]=[#6](\[#7])-[#7])-[#7]-[#6](=O)-[#6@@H](-[#7])-[#6]-c1ccc(-[#8])cc1)-[#6](-[#7])=O
: