Target
Histamine H1 receptor
Ligand
BDBM50252513
Substrate
Ki
3.4±n/a nM
Comments
PDSP_1600
Citation
 Richelson, ESouder, T Binding of antipsychotic drugs to human brain receptors focus on newer generation compounds. Life Sci 68:29-39 (2000)  
Target
Name:
Histamine H1 receptor
Synonyms:
H1R HISTAMINE H1 HRH1_HUMAN
Type:
G Protein-Coupled Receptor (GPCR)
Mol. Mass.:
55808.72
Organism:
Homo sapiens (Human)
Description:
Cell pellets from SK-N-MC cells transfected with human H1 receptor were used in binding assay.
Residue:
487
  
Inhibitor
Name:
BDBM50252513
Synonyms:
3-(2-(4-(6-fluorobenzo[d]isoxazol-3-yl)piperidin-1-yl)ethyl)-9-hydroxy-2-methyl-6,7,8,9-tetrahydropyrido[1,2-a]pyrimidin-4-one 9-hydroxy risperidone Invega | PALIPERIDONE
Type:
Small organic molecule
Emp. Form.:
C23H27FN4O3
Mol. Mass.:
426.4839
SMILES:
Cc1nc2C(O)CCCn2c(=O)c1CCN1CCC(CC1)c1noc2cc(F)ccc12
: