Target
Prostaglandin G/H synthase 2
Ligand
BDBM50056999
Substrate
Ki
560±n/a nM
Comments
PDSP_3990
Citation
 Riendeau, DPercival, MDBrideau, CCharleson, SDubé, DEthier, DFalgueyret, JPFriesen, RWGordon, RGreig, GGuay, JMancini, JOuellet, MWong, EXu, LBoyce, SVisco, DGirard, YPrasit, PZamboni, RRodger, IWGresser, MFord-Hutchinson, AWYoung, RNChan, CC Etoricoxib (MK-0663): preclinical profile and comparison with other agents that selectively inhibit cyclooxygenase-2. J Pharmacol Exp Ther 296:558-66 (2001) Target
Name:
Prostaglandin G/H synthase 2
Synonyms:
COX2 Cyclooxygenase 2 (COX-2) Cyclooxygenase-2 (COX-2 AA) Cyclooxygenase-2 (COX-2) PGH2_HUMAN PHS II Prostaglandin E synthase/G/H synthase 2 Prostaglandin-endoperoxide synthase 2
Type:
Enzyme
Mol. Mass.:
69003.89
Organism:
Homo sapiens (Human)
Description:
Recombinant Cox-2 provided by Cayman (Cayman Chemical Co.,Ann Arbor, MI).
Residue:
604
  
Inhibitor
Name:
BDBM50056999
Synonyms:
CHEMBL56367 | nimesulide
Type:
Small organic molecule
Emp. Form.:
C13H12N2O5S
Mol. Mass.:
308.31
SMILES:
CS(=O)(=O)Nc1ccc(cc1Oc1ccccc1)[N+]([O-])=O
: