Target
Glutamate receptor 3
Ligand
BDBM85743
Substrate
Ki
570±n/a nM
Comments
PDSP_3672
Citation
 Stensbøl, TBJensen, HSNielsen, BJohansen, TNEgebjerg, JFrydenvang, KKrogsgaard-Larsen, P Stereochemistry and molecular pharmacology of (S)-thio-ATPA, a new potent and selective GluR5 agonist. Eur J Pharmacol 411:245-53 (2001)  
Target
Name:
Glutamate receptor 3
Synonyms:
GRIA3_RAT Glutamate receptor 3 Glutamate-AMPA | Gria3
Type:
Enzyme Catalytic Domain
Mol. Mass.:
100383.57
Organism:
RAT
Description:
Glutamate-AMPA GRIA3 RAT::P19492
Residue:
888
  
Inhibitor
Name:
BDBM85743
Synonyms:
CAS_5289517 Thio-ATPA Thio-ATPA-S
Type:
Small organic molecule
Emp. Form.:
C10H16N2O3S
Mol. Mass.:
244.311
SMILES:
CC(C)(C)c1s[n-]c(=O)c1CC([NH3+])C(O)=O
: