Target
Glutamate receptor ionotropic, kainate 1
Ligand
BDBM85744
Substrate
Ki
>10000±n/a nM
Comments
PDSP_3671
Citation
 Stensbøl, TBJensen, HSNielsen, BJohansen, TNEgebjerg, JFrydenvang, KKrogsgaard-Larsen, P Stereochemistry and molecular pharmacology of (S)-thio-ATPA, a new potent and selective GluR5 agonist. Eur J Pharmacol 411:245-53 (2001)  
Target
Name:
Glutamate receptor ionotropic, kainate 1
Synonyms:
GRIK1_RAT Glutamate receptor ionotropic kainate 1 Glutamate receptor, ionotropic kainate 1 Grik1
Type:
Enzyme Catalytic Domain
Mol. Mass.:
107860.82
Organism:
RAT
Description:
P22756
Residue:
949
  
Inhibitor
Name:
BDBM85744
Synonyms:
ATPA-S
Type:
Small organic molecule
Emp. Form.:
C10H16N2O4
Mol. Mass.:
228.245
SMILES:
CC(C)(C)c1o[nH]c(=O)c1C[C@@H](N)C(O)=O
: