Target
Glutamate receptor ionotropic, kainate 1
Ligand
BDBM85743
Substrate
Ki
>10000±n/a nM
Comments
PDSP_3674
Citation
 Stensbøl, TBJensen, HSNielsen, BJohansen, TNEgebjerg, JFrydenvang, KKrogsgaard-Larsen, P Stereochemistry and molecular pharmacology of (S)-thio-ATPA, a new potent and selective GluR5 agonist. Eur J Pharmacol 411:245-53 (2001)  
Target
Name:
Glutamate receptor ionotropic, kainate 1
Synonyms:
GRIK1_RAT Glutamate receptor ionotropic kainate 1 Glutamate receptor, ionotropic kainate 1 Grik1
Type:
Enzyme Catalytic Domain
Mol. Mass.:
107860.82
Organism:
RAT
Description:
P22756
Residue:
949
  
Inhibitor
Name:
BDBM85743
Synonyms:
CAS_5289517 Thio-ATPA Thio-ATPA-S
Type:
Small organic molecule
Emp. Form.:
C10H16N2O3S
Mol. Mass.:
244.311
SMILES:
CC(C)(C)c1s[n-]c(=O)c1CC([NH3+])C(O)=O
: