Target
Histamine H4 receptor
Ligand
BDBM85747
Substrate
Ki
402.2±n/a nM
Comments
PDSP_537
Citation
 Nguyen, TShapiro, DAGeorge, SRSetola, VLee, DKCheng, RRauser, LLee, SPLynch, KRRoth, BLO'Dowd, BF Discovery of a novel member of the histamine receptor family. Mol Pharmacol 59:427-33 (2001)  
Target
Name:
Histamine H4 receptor
Synonyms:
AXOR35 GPCR105 HH4R HRH4 Histamine H4 receptor Histamine receptor (H3 and H4) SP9144
Type:
G Protein-Coupled Receptor (GPCR)
Mol. Mass.:
44517.02
Organism:
Homo sapiens (Human)
Description:
Binding assays were using CHO cells stably expressing hH4R receptors.
Residue:
390
  
Inhibitor
Name:
BDBM85747
Synonyms:
CAS_442-52-4 NSC_2782 | clemizole
Type:
Small organic molecule
Emp. Form.:
C19H20ClN3
Mol. Mass.:
325.835
SMILES:
Clc1ccc(Cn2c(CN3CCCC3)nc3ccccc23)cc1
: