Target
Histamine receptor H4
Ligand
BDBM22904
Substrate
Ki
0.1±n/a nM
Comments
PDSP_1585
Citation
 Zhu, YMichalovich, DWu, HTan, KBDytko, GMMannan, IJBoyce, RAlston, JTierney, LALi, XHerrity, NCVawter, LSarau, HMAmes, RSDavenport, CMHieble, JPWilson, SBergsma, DJFitzgerald, LR Cloning, expression, and pharmacological characterization of a novel human histamine receptor. Mol Pharmacol 59:434-41 (2001)  
Target
Name:
Histamine receptor H4
Synonyms:
HISTAMINE H4 Histamine H4 receptor
Type:
Enzyme Catalytic Domain
Mol. Mass.:
44536.99
Organism:
GUINEA PIG
Description:
HISTAMINE H4 HRH4 GUINEA PIG::Q91ZY3
Residue:
389
  
Inhibitor
Name:
BDBM22904
Synonyms:
(2R)-1-(1H-imidazol-5-yl)propan-2-amine Alpha-Methylhistamine-R CHEMBL268229 RAMH
Type:
Small organic molecule
Emp. Form.:
C6H11N3
Mol. Mass.:
125.1716
SMILES:
C[C@@H](N)Cc1cnc[nH]1
: