Target
Vascular endothelial growth factor receptor 2
Ligand
BDBM112653
Substrate
Meas. Tech.
Enzyme-Linked Immunosorbent Assay (ELISA)
IC50
3.0±1.0 nM
Citation
 Feng, ZCao, Z Hydroximic acid derivatives and medical applications therof US Patent  US9695181 Publication Date 7/4/2017 
Target
Name:
Vascular endothelial growth factor receptor 2
Synonyms:
CD_antigen=CD309 Fetal liver kinase 1 (FLK-1) KDR Protein-tyrosine kinase receptor Flk-1 VEGFR-2 VEGFR2 Vascular Endothelial Growth Factor Receptor Kinase 2 Vascular endothelial growth factor receptor 2 (KDR) Vascular endothelial growth factor receptor 2 (VEGFR2) Vascular endothelial growth factor receptor-2 (VEGFR-2)
Type:
Receptor Tyrosine Kinase
Mol. Mass.:
151510.97
Organism:
Homo sapiens (Human)
Description:
P35968
Residue:
1356
  
Inhibitor
Name:
BDBM112653
Synonyms:
US9695181, IIa
Type:
Small organic molecule
Emp. Form.:
C27H32N8O3
Mol. Mass.:
516.5948
SMILES:
Cc1cccc(NC(=O)Nc2ccc(cc2)-c2nn(CCCCCCCC(=O)NO)c3ncnc(N)c23)c1
: