Target
Vascular endothelial growth factor receptor 2
Ligand
BDBM158478
Substrate
Meas. Tech.
Enzyme-Linked Immunosorbent Assay (ELISA)
IC50
6.4±3.3 nM
Citation
 Feng, ZCao, Z Hydroximic acid derivatives and medical applications therof US Patent  US9695181 Publication Date 7/4/2017 
Target
Name:
Vascular endothelial growth factor receptor 2
Synonyms:
CD_antigen=CD309 Fetal liver kinase 1 (FLK-1) KDR Protein-tyrosine kinase receptor Flk-1 VEGFR-2 VEGFR2 Vascular Endothelial Growth Factor Receptor Kinase 2 Vascular endothelial growth factor receptor 2 (KDR) Vascular endothelial growth factor receptor 2 (VEGFR2) Vascular endothelial growth factor receptor-2 (VEGFR-2)
Type:
Receptor Tyrosine Kinase
Mol. Mass.:
151510.97
Organism:
Homo sapiens (Human)
Description:
P35968
Residue:
1356
  
Inhibitor
Name:
BDBM158478
Synonyms:
US10189853, sunitinib US9695181, Sunitinib
Type:
Small organic molecule
Emp. Form.:
C22H27FN4O2
Mol. Mass.:
398.4738
SMILES:
CCN(CC)CCNC(=O)c1c(C)[nH]c(\C=C2/C(=O)Nc3cccc(F)c23)c1C
: