Target
Platelet-derived growth factor receptor beta
Ligand
BDBM112878
Substrate
Meas. Tech.
Enzyme-Linked Immunosorbent Assay (ELISA)
IC50
146±0 nM
Citation
 Feng, ZCao, Z Hydroximic acid derivatives and medical applications therof US Patent  US9695181 Publication Date 7/4/2017 
Target
Name:
Platelet-derived growth factor receptor beta
Synonyms:
Beta-type platelet-derived growth factor receptor CD140b antigen PDGF Receptor Substrate PDGFR PDGFR-1 PDGFRB PGFRB_HUMAN Platelet-derived growth factor receptor 1 Platelet-derived growth factor receptor beta (PDGFR-beta) Platelet-derived growth factor receptor beta (PDGFRbeta) | VHL/PDGFRB
Type:
Enzyme
Mol. Mass.:
123922.25
Organism:
Homo sapiens (Human)
Description:
P09619
Residue:
1106
  
Inhibitor
Name:
BDBM112878
Synonyms:
US9695181, IIc
Type:
Small organic molecule
Emp. Form.:
C27H32FN9O3
Mol. Mass.:
549.5999
SMILES:
CN(CCCC(=O)NO)CCCn1nc(-c2ccc(NC(=O)Nc3cc(C)ccc3F)cc2)c2c(N)ncnc12
: