Target
Adenosine receptor A3
Ligand
BDBM21220
Substrate
Ki
37.08±n/a nM
Comments
PDSP_1302
Citation
 Durand, IHGreen, RD Cloning of a chick A3 adenosine receptor: characterization of ligand binding and receptor-effector coupling of chick A1 and A3 adenosine receptors. Naunyn Schmiedebergs Arch Pharmacol 363:81-6 (2001)  
Target
Name:
Adenosine receptor A3
Synonyms:
ADENOSINE A3 | ADORA3
Type:
Enzyme Catalytic Domain
Mol. Mass.:
37723.59
Organism:
Chick
Description:
A0A8V1ACC1
Residue:
338
  
Inhibitor
Name:
BDBM21220
Synonyms:
(2S,3S,4R,5R)-5-(6-amino-9H-purin-9-yl)-N-ethyl-3,4-dihydroxyoxolane-2-carboxamide Adenosine, N6-Ethyl-carboxamido CHEMBL464859 NECA
Type:
Antineoplastic Agent
Emp. Form.:
C12H16N6O4
Mol. Mass.:
308.2932
SMILES:
CCNC(=O)[C@H]1O[C@H]([C@H](O)[C@@H]1O)n1cnc2c(N)ncnc12
: