Target
Alpha-2B adrenergic receptor
Ligand
BDBM50013515
Substrate
Ki
11.3±n/a nM
Comments
PDSP_1590
Citation
 Naselsky, DPAshton, DRuffolo, RRHieble, JP Rabbit alpha2-adrenoceptors: both platelets and adipocytes have alpha2A-pharmacology. J Pharmacol Exp Ther 298:219-25 (2001) Target
Name:
Alpha-2B adrenergic receptor
Synonyms:
ADA2B_RABIT Alpha-2B adrenergic receptor | adrenergic Alpha2
Type:
Enzyme Catalytic Domain
Mol. Mass.:
42909.14
Organism:
RABBIT
Description:
adrenergic Alpha2 0 RABBIT::O77830
Residue:
394
  
Inhibitor
Name:
BDBM50013515
Synonyms:
(+)-yohimbine 17alpha-hydroxyyohimban-16alpha-carboxylic acid methyl ester CORYNANTHINE Quebrachin YOHIMBINE CHLORIDE Yohimbine cid_8969 methyl 17alpha-hydroxyyohimban-16alpha-carboxylate yohimbic acid methyl ester
Type:
Small organic molecule
Emp. Form.:
C21H26N2O3
Mol. Mass.:
354.4427
SMILES:
COC(=O)[C@H]1[C@@H](O)CC[C@H]2CN3CCc4c([nH]c5ccccc45)[C@@H]3C[C@H]12
: