Target
Alpha-2B adrenergic receptor
Ligand
BDBM50019492
Substrate
Ki
7.3±n/a nM
Comments
PDSP_1648
Citation
 Naselsky, DPAshton, DRuffolo, RRHieble, JP Rabbit alpha2-adrenoceptors: both platelets and adipocytes have alpha2A-pharmacology. J Pharmacol Exp Ther 298:219-25 (2001) Target
Name:
Alpha-2B adrenergic receptor
Synonyms:
ADA2B_RABIT Alpha-2B adrenergic receptor | adrenergic Alpha2
Type:
Enzyme Catalytic Domain
Mol. Mass.:
42909.14
Organism:
RABBIT
Description:
adrenergic Alpha2 0 RABBIT::O77830
Residue:
394
  
Inhibitor
Name:
BDBM50019492
Synonyms:
(+)2-(2-Methoxy-2,3-dihydro-benzo[1,4]dioxin-2-yl)-4,5-dihydro-1H-imidazole 2-(2,3-dihydro-2-methoxy-1,4-benzodioxin-2-yl)-4,5-dihydro-1H-imidazole 2-(2-methoxy-2,3-dihydrobenzo[b][1,4]dioxin-2-yl)-4,5-dihydro-1H-imidazole CHEMBL10332 RX821002
Type:
Small organic molecule
Emp. Form.:
C12H14N2O3
Mol. Mass.:
234.2512
SMILES:
COC1(COc2ccccc2O1)C1=NCCN1
: