Target
Neuropeptide Y receptor type 2
Ligand
BDBM85794
Substrate
Ki
1.66±n/a nM
Comments
PDSP_1560
Citation
 Goumain, MVoisin, TLorinet, AMDucroc, RTsocas, ARozé, CRouet-Benzineb, PHerzog, HBalasubramaniam, ALaburthe, M The peptide YY-preferring receptor mediating inhibition of small intestinal secretion is a peripheral Y(2) receptor: pharmacological evidence and molecular cloning. Mol Pharmacol 60:124-34 (2001)  
Target
Name:
Neuropeptide Y receptor type 2
Synonyms:
NPY-Y2 Neuropeptide Y receptor type 2 | Neuropeptide Y/peptide YY-Y2 receptor
Type:
Enzyme Catalytic Domain
Mol. Mass.:
42514.44
Organism:
RAT
Description:
NPY-Y2 NPY2R RAT::Q9ERC0
Residue:
381
  
Inhibitor
Name:
BDBM85794
Synonyms:
PYY, N-alpha-Ac, 22-36
Type:
Small organic molecule
Emp. Form.:
C87H141N29O22
Mol. Mass.:
1945.2315
SMILES:
CC[C@H](C)[C@H](NC(=O)[C@H](Cc1ccc(O)cc1)NC(=O)[C@H](Cc1cnc[nH]1)NC(=O)[C@H](CCCN=C(N)N)NC(=O)[C@H](CC(C)C)NC(=O)[C@H](CO)NC(=O)[C@H](C)NC(C)=O)C(=O)N[C@@H](CC(N)=O)C(=O)N[C@@H](CC(C)C)C(=O)N[C@@H]([C@@H](C)CC)C(=O)N[C@@H]([C@@H](C)O)C(=O)N[C@@H](CCCN=C(N)N)C(=O)N[C@@H](CCC(N)=O)C(=O)N[C@@H](CCCN=C(N)N)C(=O)N[C@@H](Cc1ccc(O)cc1)C(N)=O
: