Target
Serine/threonine-protein kinase receptor R3
Ligand
BDBM143566
Substrate
Meas. Tech.
Enzyme Assay
IC50
16.0±n/a nM
Citation
 Alimardanov, ACuny, GDGrewal, GSLee, AMcKew, JCMohedas, AHShen, MXu, XYu, PB BMP inhibitors and methods of use thereof US Patent  US10017516 Publication Date 7/10/2018 
Target
Name:
Serine/threonine-protein kinase receptor R3
Synonyms:
ACVL1_HUMAN ACVRLK1 Activin receptor-like kinase 1 (ALK-1) | Serine/threonine-protein kinase receptor R3 (ALK1)
Type:
Enzyme
Mol. Mass.:
56134.46
Organism:
Homo sapiens (Human)
Description:
P37023
Residue:
503
  
Inhibitor
Name:
BDBM143566
Synonyms:
US10017516, Compound 13 | US9682983, 13
Type:
Small organic molecule
Emp. Form.:
C27H25N5
Mol. Mass.:
419.5209
SMILES:
Cc1cc(-c2cnn3cc(cnc23)-c2ccc(cc2)C2CCNCC2)c2ccccc2n1
: