Target
Glutamate receptor 3
Ligand
BDBM390
Substrate
Ki
9400±n/a nM
Comments
PDSP_3685
Citation
 Johansen, TNStensbøl, TBNielsen, BVogensen, SBFrydenvang, KSløk, FABräüner-Osborne, HMadsen, UKrogsgaard-Larsen, P Resolution, configurational assignment, and enantiopharmacology at glutamate receptors of 2-amino-3-(3-carboxy-5-methyl-4-isoxazolyl)propionic acid (ACPA) and demethyl-ACPA. Chirality 13:523-32 (2001)  
Target
Name:
Glutamate receptor 3
Synonyms:
GRIA3_RAT Glutamate receptor 3 Glutamate-AMPA | Gria3
Type:
Enzyme Catalytic Domain
Mol. Mass.:
100383.57
Organism:
RAT
Description:
Glutamate-AMPA GRIA3 RAT::P19492
Residue:
888
  
Inhibitor
Name:
BDBM390
Synonyms:
(R)-Demethyl-ACPA
Type:
Emp. Form.:
C7H8N2O5
Mol. Mass.:
200.1488
SMILES:
N[C@@H](Cc1conc1C(O)=O)C(O)=O
: