Target
Hrh3 protein
Ligand
BDBM22913
Substrate
Ki
1.48±n/a nM
Comments
PDSP_2292
Citation
 Wieland, KBongers, GYamamoto, YHashimoto, TYamatodani, AMenge, WMTimmerman, HLovenberg, TWLeurs, R Constitutive activity of histamine h(3) receptors stably expressed in SK-N-MC cells: display of agonism and inverse agonism by H(3) antagonists. J Pharmacol Exp Ther 299:908-14 (2001) Target
Name:
Hrh3 protein
Synonyms:
HISTAMINE H3 Hrh3 protein
Type:
Enzyme Catalytic Domain
Mol. Mass.:
37860.96
Organism:
RAT
Description:
Q5PPG3
Residue:
344
  
Inhibitor
Name:
BDBM22913
Synonyms:
CHEMBL1237146 Iodophenpropit | {[3-(1H-imidazol-5-yl)propyl]sulfanyl}-N''-[2-(4-iodophenyl)ethyl]methanimidamide
Type:
Small organic molecule
Emp. Form.:
C15H19IN4S
Mol. Mass.:
414.308
SMILES:
NC(SCCCc1cnc[nH]1)=NCCc1ccc(I)cc1
: