Target
Glycine receptor subunit alpha-1
Ligand
BDBM82071
Substrate
Ki
1000±n/a nM
Comments
PDSP_1947
Citation
 Bymaster, FPDreshfield-Ahmad, LJThrelkeld, PGShaw, JLThompson, LNelson, DLHemrick-Luecke, SKWong, DT Comparative affinity of duloxetine and venlafaxine for serotonin and norepinephrine transporters in vitro and in vivo, human serotonin receptor subtypes, and other neuronal receptors. Neuropsychopharmacology 25:871-80 (2001)  
Target
Name:
Glycine receptor subunit alpha-1
Synonyms:
GLRA1_RAT Glycine receptor alpha-1 chain Glycine, non-strychnine Glyr
Type:
Enzyme Catalytic Domain
Mol. Mass.:
52629.37
Organism:
RAT
Description:
Glycine, non-strychnine 0 RAT::P07727
Residue:
457
  
Inhibitor
Name:
BDBM82071
Synonyms:
CAS_93413-69-5 NSC_62923 Venlafaxine hydrochloride WY-45655
Type:
Small organic molecule
Emp. Form.:
C17H27NO2
Mol. Mass.:
277.4018
SMILES:
COc1ccc(cc1)C(CN(C)C)C1(O)CCCCC1
: