Target
Adenosine receptor A3
Ligand
BDBM50109481
Substrate
Ki
0.53±n/a nM
Comments
PDSP_2332
Citation
 Gessi, SVarani, KMerighi, SCattabriga, EIannotta, VLeung, EBaraldi, PGBorea, PA A(3) adenosine receptors in human neutrophils and promyelocytic HL60 cells: a pharmacological and biochemical study. Mol Pharmacol 61:415-24 (2002)  
Target
Name:
Adenosine receptor A3
Synonyms:
A3 adenosine receptor (hA3) ADORA3 | Adenosine A3 receptor (A3AR)
Type:
G Protein-Coupled Receptor (GPCR)
Mol. Mass.:
36197.32
Organism:
Homo sapiens (Human)
Description:
P0DMS8
Residue:
318
  
Inhibitor
Name:
BDBM50109481
Synonyms:
1-(2-(furan-2-yl)-8-propyl-8H-pyrazolo[4,3-e][1,2,4]triazolo[1,5-c]pyrimidin-5-yl)-3-phenylurea CHEMBL168018 | MRE 3055F20
Type:
Small organic molecule
Emp. Form.:
C20H18N8O2
Mol. Mass.:
402.4093
SMILES:
CCCn1cc2c(n1)nc(NC(=O)Nc1ccccc1)n1nc(nc21)-c1ccco1
: