Target
VIP peptides
Ligand
BDBM85873
Substrate
Ki
0.17±n/a nM
Comments
PDSP_2124
Citation
 Igarashi, HIto, THou, WMantey, SAPradhan, TKUlrich, CDHocart, SJCoy, DHJensen, RT Elucidation of vasoactive intestinal peptide pharmacophore for VPAC(1) receptors in human, rat, and guinea pig. J Pharmacol Exp Ther 301:37-50 (2002)  
Target
Name:
VIP peptides
Synonyms:
VIP peptides Vip
Type:
Enzyme Catalytic Domain
Mol. Mass.:
19078.15
Organism:
RAT
Description:
VIP 0 RAT::P01283
Residue:
170
  
Inhibitor
Name:
BDBM85873
Synonyms:
VIP Ala2
Type:
Small organic molecule
Emp. Form.:
C147H240N44O40S
Mol. Mass.:
3295.814
SMILES:
CC[C@H](C)[C@H](NC(=O)[C@H](CO)NC(=O)[C@H](CC(N)=O)NC(=O)[C@H](CC(C)C)NC(=O)[C@H](Cc1ccc(O)cc1)NC(=O)[C@H](CCCCN)NC(=O)[C@H](CCCCN)NC(=O)[C@@H](NC(=O)[C@H](C)NC(=O)[C@H](CCSC)NC(=O)[C@H](CCC(N)=O)NC(=O)[C@H](CCCCN)NC(=O)[C@H](CCCN=C(N)N)NC(=O)[C@H](CC(C)C)NC(=O)[C@H](CCCN=C(N)N)NC(=O)C(NC(=O)[C@H](Cc1ccc(O)cc1)NC(=O)[C@H](CC(N)=O)NC(=O)[C@H](CC(O)=O)NC(=O)[C@@H](NC(=O)[C@H](Cc1ccccc1)NC(=O)[C@@H](NC(=O)[C@H](C)NC(=O)[C@@H](NC(=O)[C@H](C)NC(=O)[C@@H](N)Cc1cnc[nH]1)C(C)O)C(C)C)[C@@H](C)O)[C@@H](C)O)C(C)C)C(=O)N[C@@H](CC(C)C)C(=O)N[C@@H](CC(N)=O)C(N)=O
: