Target
Beta-secretase 1
Ligand
BDBM276787
Substrate
Meas. Tech.
BACE-1 Ki Assay (BACE-1 HTRF FRET Assay)
pH
5±n/a
Ki
1.50±n/a nM
Comments
extracted
Citation
 Wu, WHe, SWalsh, SPCumming, JN Iminothiadiazine dioxides bearing an amine-linked substituent as BACE inhibitors, compositions, and their use US Patent  US10071998 Publication Date 9/11/2018 
Target
Name:
Beta-secretase 1
Synonyms:
ASP2 Aspartyl protease 2 BACE1 Beta-secretase (BACE) Beta-secretase 1 (BACE 1) Beta-secretase 1 (BACE1) Beta-site amyloid precursor protein cleaving enzyme 1 Memapsin-2 beta-Secretase (BACE-1) | beta-Secretase (BACE1)
Type:
Protein
Mol. Mass.:
55755.10
Organism:
Homo sapiens (Human)
Description:
P56817
Residue:
501
  
Inhibitor
Name:
BDBM276787
Synonyms:
3-bromo-N-{4-fluoro-3-[(5R)-3-imino-2,5-dimethyl-1,1-dioxido-1,2,4-thiadiazinan-5-yl]phenyl}-1,7-naphthyridin-8-amine | US10071998, Example 2
Type:
Small organic molecule
Emp. Form.:
C19H18BrFN6O2S
Mol. Mass.:
493.353
SMILES:
CN1C(=N)N[C@@](C)(CS1(=O)=O)c1cc(Nc2nccc3cc(Br)cnc23)ccc1F
: