Target
Beta-secretase 2
Ligand
BDBM276788
Substrate
Meas. Tech.
BACE-2 Assay
pH
5±n/a
Ki
0.810±n/a nM
Comments
extracted
Citation
 Wu, WHe, SWalsh, SPCumming, JN Iminothiadiazine dioxides bearing an amine-linked substituent as BACE inhibitors, compositions, and their use US Patent  US10071998 Publication Date 9/11/2018 
Target
Name:
Beta-secretase 2
Synonyms:
AEPLC ASP1 Asp 1 Aspartyl protease 1 BACE2_HUMAN Beta-secretase (BACE) Beta-secretase 2 (BACE-2) Beta-site APP-cleaving enzyme 2 Memapsin-1 beta-Secretase (BACE-2)
Type:
Protein
Mol. Mass.:
56171.20
Organism:
Homo sapiens (Human)
Description:
Q9Y5Z0
Residue:
518
  
Inhibitor
Name:
BDBM276788
Synonyms:
7-bromo-N-{4-fluoro-3-[(5R)-3-imino-2,5-dimethyl-1,1-dioxido-1,2,4-thiadiazinan-5-yl]phenyl}pyrido[3,2-d]pyrimidin-4-amine | US10071998, Example 3
Type:
Small organic molecule
Emp. Form.:
C18H17BrFN7O2S
Mol. Mass.:
494.341
SMILES:
CN1C(=N)N[C@@](C)(CS1(=O)=O)c1cc(Nc2ncnc3cc(Br)cnc23)ccc1F
: