Target
Melanin-concentrating hormone receptor 1
Ligand
BDBM85947
Substrate
Ki
14±n/a nM
Comments
PDSP_2481
Citation
 Bednarek, MAHreniuk, DLTan, CPalyha, OCMacNeil, DJVan der Ploeg, LHHoward, ADFeighner, SD Synthesis and biological evaluation in vitro of selective, high affinity peptide antagonists of human melanin-concentrating hormone action at human melanin-concentrating hormone receptor 1. Biochemistry 41:6383-90 (2002)  
Target
Name:
Melanin-concentrating hormone receptor 1
Synonyms:
G-protein coupled receptor 24 MCH receptor 1 MCH-R1 MCHR-1 MCHR1_HUMAN Melanin-Concentrating Hormone Receptor 1 (MCH1R) Melanin-concentrating hormone receptor 1 (MCH-1) Melanin-concentrating hormone receptor 1 (MCHR-1) SLC-1 Somatostatin receptor-like protein
Type:
G Protein-Coupled Receptor (GPCR)
Mol. Mass.:
45976.27
Organism:
Homo sapiens (Human)
Description:
Membranes from CHO-K1 cells stably expressing human MCH1R were used in assays.
Residue:
422
  
Inhibitor
Name:
BDBM85947
Synonyms:
Gva6,Ava14,15 | Gva6,betaAla14,15
Type:
Small organic molecule
Emp. Form.:
C50H84N16O11S3
Mol. Mass.:
1181.498
SMILES:
[#6]-[#16]-[#6]-[#6]-[#6]-1-[#7]-[#6](=O)-[#6](-[#6]-[#16]-[#16]-[#6]-[#6](-[#7]-[#6](=O)-[#6]-[#6]-[#6]-[#6]-[#7]-[#6](=O)-[#6](-[#6]-c2ccc(-[#8])cc2)-[#7]-[#6](=O)-[#6](-[#7]-[#6](=O)-[#6](-[#6]-[#6]-[#6]\[#7]=[#6](\[#7])-[#7])-[#7]-[#6](=O)-[#6]-[#7]-[#6](=O)-[#6](-[#6]-[#6](-[#6])-[#6])-[#7]-[#6]-1=O)-[#6](-[#6])-[#6])-[#6](-[#7])=O)-[#7]-[#6](=O)-[#6]-[#6]-[#6]-[#6]\[#7]=[#6](\[#7])-[#7]
: