Target
Carboxylic ester hydrolase
Ligand
BDBM86005
Substrate
Meas. Tech.
Enzyme Inhibition Assay
pH
8±0
Temperature
298.15±0 K
IC50
3.90e+4± 5.0e+3 nM
Citation
 Hasan, AKhan, KMSher, MMaharvi, GMNawaz, SAChoudhary, MIAtta-ur-Rahman, ASupuran, CT Synthesis and inhibitory potential towards acetylcholinesterase, butyrylcholinesterase and lipoxygenase of some variably substituted chalcones. J Enzyme Inhib Med Chem 20:41-7 (2005)  
Target
Name:
Carboxylic ester hydrolase
Synonyms:
BuChE Butyrylcholine esterase Butyrylcholinesterase (BChE) Butyrylcholinesterase (EqBuChE) butyrylcholinesterase precursor
Type:
Protein
Mol. Mass.:
68842.83
Organism:
Equus caballus (Horse)
Description:
Q9N1N9
Residue:
602
  
Inhibitor
Name:
BDBM86005
Synonyms:
Chalcone, 4
Type:
Small organic molecule
Emp. Form.:
C16H14O2
Mol. Mass.:
238.2812
SMILES:
COc1ccc(\C=C\C(=O)c2ccccc2)cc1
: