Target
Neuropeptide Y receptor type 5
Ligand
BDBM50089038
Substrate
Ki
0.24±n/a nM
Comments
PDSP_7139
Citation
 Holmberg, SKMikko, SBoswell, TZoorob, RLarhammar, D Pharmacological characterization of cloned chicken neuropeptide Y receptors Y1 and Y5. J Neurochem 81:462-71 (2002)  
Target
Name:
Neuropeptide Y receptor type 5
Synonyms:
NPY-Y5 | NPY5R
Type:
Enzyme Catalytic Domain
Mol. Mass.:
50065.15
Organism:
Chicken
Description:
Q8QFM2
Residue:
443
  
Inhibitor
Name:
BDBM50089038
Synonyms:
CGP 71683 CHEMBL17645 Naphthalene-1-sulfonic acid {4-[(4-amino-quinazolin-2-ylamino)-methyl]-cyclohexylmethyl}-amide
Type:
Small organic molecule
Emp. Form.:
C26H29N5O2S
Mol. Mass.:
475.606
SMILES:
Nc1nc(NC[C@H]2CC[C@H](CNS(=O)(=O)c3cccc4ccccc34)CC2)nc2ccccc12
: