Target
Histamine H1 receptor
Ligand
BDBM22567
Substrate
Ki
1.18±n/a nM
Comments
PDSP_1202
Citation
 Booth, RGMoniri, NHBakker, RAChoksi, NYNix, WBTimmerman, HLeurs, R A novel phenylaminotetralin radioligand reveals a subpopulation of histamine H(1) receptors. J Pharmacol Exp Ther 302:328-36 (2002)  
Target
Name:
Histamine H1 receptor
Synonyms:
H1R HISTAMINE H1 HRH1_HUMAN
Type:
G Protein-Coupled Receptor (GPCR)
Mol. Mass.:
55808.72
Organism:
Homo sapiens (Human)
Description:
Cell pellets from SK-N-MC cells transfected with human H1 receptor were used in binding assay.
Residue:
487
  
Inhibitor
Name:
BDBM22567
Synonyms:
3H]pyrilamine Dorantamin N-(4-methoxybenzyl)-N ,N -dimethyl-N-pyridin-2-ylethane-1,2-diamine PYRILAMINE [3H]mepyramine | [3H]pyrilamine
Type:
radiolabeled ligand
Emp. Form.:
C17H23N3O
Mol. Mass.:
285.384
SMILES:
COc1ccc(CN(CCN(C)C)c2ccccn2)cc1
: