Target
5-hydroxytryptamine receptor 3A
Ligand
BDBM84979
Substrate
Ki
>10000±n/a nM
Comments
PDSP_3185
Citation
 Butterweck, VNahrstedt, AEvans, JHufeisen, SRauser, LSavage, JPopadak, BErnsberger, PRoth, BL In vitro receptor screening of pure constituents of St. John's wort reveals novel interactions with a number of GPCRs. Psychopharmacology (Berl) 162:193-202 (2002)  
Target
Name:
5-hydroxytryptamine receptor 3A
Synonyms:
5-HT-3 5-HT3A 5-hydroxytryptamine receptor 3 (5-HT3) 5-hydroxytryptamine receptor 3A (5HT3A) 5HT3R HTR3A Serotonin 3 receptor (5HT3) Serotonin-gated ion channel receptor | Serotonin-gated ion channel receptor 3
Type:
Protein
Mol. Mass.:
55283.27
Organism:
Homo sapiens (Human)
Description:
P46098
Residue:
478
  
Inhibitor
Name:
BDBM84979
Synonyms:
Isoquercitrin
Type:
Small organic molecule
Emp. Form.:
C21H20O12
Mol. Mass.:
464.3763
SMILES:
OCC1OC(O)C(Oc2c(O)c3c(cc(O)cc3=O)oc2-c2ccc(O)c(O)c2)C(O)C1O
: