Target
Delta-type opioid receptor
Ligand
BDBM7460
Substrate
Ki
>10000±n/a nM
Comments
PDSP_3175
Citation
 Butterweck, VNahrstedt, AEvans, JHufeisen, SRauser, LSavage, JPopadak, BErnsberger, PRoth, BL In vitro receptor screening of pure constituents of St. John's wort reveals novel interactions with a number of GPCRs. Psychopharmacology (Berl) 162:193-202 (2002)  
Target
Name:
Delta-type opioid receptor
Synonyms:
Delta opioid receptor OPIATE Delta OPRD_PIG
Type:
Enzyme Catalytic Domain
Mol. Mass.:
25736.90
Organism:
GUINEA PIG
Description:
OPIATE Delta OPRD1 GUINEA PIG::P79291
Residue:
228
  
Inhibitor
Name:
BDBM7460
Synonyms:
2-(3,4-dihydroxyphenyl)-3,5,7-trihydroxy-4H-chromen-4-one 2-(3,4-dihydroxyphenyl)-3,5,7-trihydroxy-chromone;hydrate Quercetin Quercetin (21) US11021454, Compound Quercetin med.21724, Compound 4
Type:
Small organic molecule
Emp. Form.:
C15H10O7
Mol. Mass.:
302.2357
SMILES:
Oc1cc(O)c2c(c1)oc(-c1ccc(O)c(O)c1)c(O)c2=O
: