Target
Metabotropic glutamate receptor 2
Ligand
BDBM277091
Substrate
Meas. Tech.
Biological Assays
IC50
21800±n/a nM
Citation
 Arasappan, ABungard, CJFrie, JLHan, YHoyt, SBManley, PJMeissner, RSPerkins, JJSebhat, IKWilkening, RRLeavitt, KJ Tetrahydronaphthyridine derivatives as mGluR2-negative allosteric modulators, compositions, and their use US Patent  US10072003 Publication Date 9/11/2018 
Target
Name:
Metabotropic glutamate receptor 2
Synonyms:
GPRC1B GRM2_HUMAN Metabotropic glutamate receptor mGlu2 | metabotropic glutamate 2
Type:
Enzyme
Mol. Mass.:
95584.88
Organism:
Homo sapiens (Human)
Description:
Q14416
Residue:
872
  
Inhibitor
Name:
BDBM277091
Synonyms:
4-(2,4-difluorophenyl)-7- [(1,4-dimethyl-1H- pyrazol-5-yl)methyl]- 5,6,7,8-tetrahydro-1,7- naphthyridine-2- carboxamide | US10072003, Example 1-10
Type:
Small organic molecule
Emp. Form.:
C21H21F2N5O
Mol. Mass.:
397.4211
SMILES:
Cc1cnn(C)c1CN1CCc2c(C1)nc(cc2-c1ccc(F)cc1F)C(N)=O
: