Target
Metabotropic glutamate receptor 2
Ligand
BDBM277153
Substrate
Meas. Tech.
Biological Assays
IC50
92700±n/a nM
Citation
 Arasappan, ABungard, CJFrie, JLHan, YHoyt, SBManley, PJMeissner, RSPerkins, JJSebhat, IKWilkening, RRLeavitt, KJ Tetrahydronaphthyridine derivatives as mGluR2-negative allosteric modulators, compositions, and their use US Patent  US10072003 Publication Date 9/11/2018 
Target
Name:
Metabotropic glutamate receptor 2
Synonyms:
GPRC1B GRM2_HUMAN Metabotropic glutamate receptor mGlu2 | metabotropic glutamate 2
Type:
Enzyme
Mol. Mass.:
95584.88
Organism:
Homo sapiens (Human)
Description:
Q14416
Residue:
872
  
Inhibitor
Name:
BDBM277153
Synonyms:
(S) or (R)-4-(4-methyl-3- (trifluoromethyl)piperazin- 1-yl-7-((2- (trifluoromethyl)pyridin-4- yl)methyl)-5,6,7,8- tetrahydro-1,7- naphthyridine-2- carboxamide | US10072003, Example 5-9
Type:
Small organic molecule
Emp. Form.:
C22H24F6N6O
Mol. Mass.:
502.456
SMILES:
CN1CCN(CC1C(F)(F)F)c1cc(nc2CN(Cc3ccnc(c3)C(F)(F)F)CCc12)C(N)=O
: