Target
neuronal acetylcholine receptor subunit alpha-2
Ligand
BDBM50063218
Substrate
Ki
87±n/a nM
Comments
PDSP_785
Citation
 Avalos, MParker, MJMaddox, FNCarroll, FILuetje, CW Effects of pyridine ring substitutions on affinity, efficacy, and subtype selectivity of neuronal nicotinic receptor agonist epibatidine. J Pharmacol Exp Ther 302:1246-52 (2002)  
Target
Name:
neuronal acetylcholine receptor subunit alpha-2
Synonyms:
Cholinergic, Nicotinic Alpha2Beta2 | Cholinergic, Nicotinic Alpha2Beta4
Type:
Enzyme Catalytic Domain
Mol. Mass.:
59160.03
Organism:
Xenopus
Description:
A0A6I8T284
Residue:
510
  
Inhibitor
Name:
BDBM50063218
Synonyms:
(R)-2-(6-Chloro-pyridin-3-yl)-7-aza-bicyclo[2.2.1]heptane Epibatidine | rac-(2R)-2-(6-chloropyridin-3-yl)-7-aza-bicyclo[2.2.1]heptane
Type:
Small organic molecule
Emp. Form.:
C11H13ClN2
Mol. Mass.:
208.687
SMILES:
Clc1ccc(cn1)[C@H]1CC2CCC1N2
: