Target
cholinergic receptor, nicotinic, alpha 1 (Muscle) isoform X1
Ligand
BDBM50119631
Substrate
Ki
100±n/a nM
Comments
PDSP_2901
Citation
 Avalos, MParker, MJMaddox, FNCarroll, FILuetje, CW Effects of pyridine ring substitutions on affinity, efficacy, and subtype selectivity of neuronal nicotinic receptor agonist epibatidine. J Pharmacol Exp Ther 302:1246-52 (2002)  
Target
Name:
cholinergic receptor, nicotinic, alpha 1 (Muscle) isoform X1
Synonyms:
Cholinergic, Nicotinic Alpha3Beta2
Type:
Enzyme Catalytic Domain
Mol. Mass.:
51980.65
Organism:
Xenopus
Description:
Cholinergic, Nicotinic Alpha3Beta2 0 Xenopus::F6RLM5
Residue:
457
  
Inhibitor
Name:
BDBM50119631
Synonyms:
5-(7-Aza-bicyclo[2.2.1]hept-2-yl)-pyridin-2-ol NOHEP
Type:
Small organic molecule
Emp. Form.:
C11H14N2O
Mol. Mass.:
190.2417
SMILES:
O=c1ccc(c[nH]1)[C@H]1CC2CCC1N2
: