Target
Substance-K receptor
Ligand
BDBM50051290
Substrate
Ki
20.4±n/a nM
Comments
PDSP_1749
Citation
 Anthes, JCChapman, RWRichard, CEckel, SCorboz, MHey, JAFernandez, XGreenfeder, SMcLeod, RSehring, SRizzo, CCrawley, YShih, NYPiwinski, JReichard, GTing, PCarruthers, NCuss, FMBillah, MKreutner, WEgan, RW SCH 206272: a potent, orally active tachykinin NK(1), NK(2), and NK(3) receptor antagonist. Eur J Pharmacol 450:191-202 (2002)  
Target
Name:
Substance-K receptor
Synonyms:
NK-2 receptor NK2R NKNAR Neurokinin A receptor Neurokinin-2 (NK-2) SKR TACR2 Tachykinin receptor 2 (NK2) | hnk-3
Type:
Protein
Mol. Mass.:
44455.78
Organism:
Homo sapiens (Human)
Description:
P21452
Residue:
398
  
Inhibitor
Name:
BDBM50051290
Synonyms:
CHEMBL299377 SR 142801 SR-142801
Type:
Small organic molecule
Emp. Form.:
C35H41Cl2N3O2
Mol. Mass.:
606.625
SMILES:
CN(C(C)=O)C1(CCN(CCCC2(CCCN(C2)C(=O)c2ccccc2)c2ccc(Cl)c(Cl)c2)CC1)c1ccccc1
: