Target
Vasoactive intestinal polypeptide receptor 2
Ligand
BDBM85887
Substrate
Ki
38.1±n/a nM
Comments
PDSP_2132
Citation
 Igarashi, HIto, TPradhan, TKMantey, SAHou, WCoy, DHJensen, RT Elucidation of the vasoactive intestinal peptide pharmacophore for VPAC(2) receptors in human and rat and comparison to the pharmacophore for VPAC(1) receptors. J Pharmacol Exp Ther 303:445-60 (2002)  
Target
Name:
Vasoactive intestinal polypeptide receptor 2
Synonyms:
VIP 2 VIPR2 | VIPR2_HUMAN
Type:
Enzyme Catalytic Domain
Mol. Mass.:
49488.30
Organism:
Homo sapiens (Human)
Description:
VIP 2 VIPR2 HUMAN::P41587
Residue:
438
  
Inhibitor
Name:
BDBM85887
Synonyms:
VIP Ala11
Type:
Small organic molecule
Emp. Form.:
C146H236N44O41S
Mol. Mass.:
3295.771
SMILES:
CC[C@H](C)[C@H](NC(=O)[C@H](CO)NC(=O)[C@H](CC(N)=O)NC(=O)[C@H](CC(C)C)NC(=O)[C@H](Cc1ccc(O)cc1)NC(=O)[C@H](CCCCN)NC(=O)[C@H](CCCCN)NC(=O)[C@@H](NC(=O)[C@H](C)NC(=O)[C@H](CCSC)NC(=O)[C@H](CCC(N)=O)NC(=O)[C@H](CCCCN)NC(=O)[C@H](CCCN=C(N)N)NC(=O)[C@H](CC(C)C)NC(=O)[C@H](CCCN=C(N)N)NC(=O)[C@H](C)NC(=O)[C@H](Cc1ccc(O)cc1)NC(=O)[C@H](CC(N)=O)NC(=O)[C@H](CC(O)=O)NC(=O)[C@@H](NC(=O)[C@H](Cc1ccccc1)NC(=O)[C@@H](NC(=O)[C@H](C)NC(=O)[C@H](CC(O)=O)NC(=O)[C@H](CO)NC(=O)[C@@H](N)Cc1cnc[nH]1)C(C)C)[C@@H](C)O)C(C)C)C(=O)N[C@@H](CC(C)C)C(=O)N[C@@H](CC(N)=O)C(N)=O
: