Target
Muscarinic acetylcholine receptor M1
Ligand
BDBM277252
Substrate
Meas. Tech.
In Vitro Cellular Assay
Temperature
298.15±n/a K
EC50
31.6±n/a nM
Comments
extracted
Citation
 Payne, ACastro Pineiro, JLBirch, LMKhan, ABraunton, AJKitulagoda, JESoejima, M 4-azaindole derivatives US Patent  US10072005 Publication Date 9/11/2018 
Target
Name:
Muscarinic acetylcholine receptor M1
Synonyms:
ACM1_HUMAN Cholinergic receptor, muscarinic 1 | Cholinergic, muscarinic M1
Type:
Protein
Mol. Mass.:
51442.54
Organism:
Homo sapiens (Human)
Description:
P11229
Residue:
460
  
Inhibitor
Name:
BDBM277252
Synonyms:
US10072005, Example 45
Type:
Small organic molecule
Emp. Form.:
C27H27FN4O2
Mol. Mass.:
458.5273
SMILES:
Cc1cc(ccn1)-c1ccc(Cn2cc(C(=O)N[C@H]3CCCC[C@@H]3O)c3ncccc23)c(F)c1
: