Target
Muscarinic acetylcholine receptor M1
Ligand
BDBM277259
Substrate
Meas. Tech.
In Vitro Cellular Assay
Temperature
298.15±n/a K
EC50
200±n/a nM
Comments
extracted
Citation
 Payne, ACastro Pineiro, JLBirch, LMKhan, ABraunton, AJKitulagoda, JESoejima, M 4-azaindole derivatives US Patent  US10072005 Publication Date 9/11/2018 
Target
Name:
Muscarinic acetylcholine receptor M1
Synonyms:
ACM1_HUMAN Cholinergic receptor, muscarinic 1 | Cholinergic, muscarinic M1
Type:
Protein
Mol. Mass.:
51442.54
Organism:
Homo sapiens (Human)
Description:
P11229
Residue:
460
  
Inhibitor
Name:
BDBM277259
Synonyms:
US10072005, Example 52
Type:
Small organic molecule
Emp. Form.:
C23H24N6O
Mol. Mass.:
400.4763
SMILES:
O=C(N[C@H]1CCCNC1)c1cn(Cc2ccc(cc2)-n2cccn2)c2cccnc12
: