Target
Muscarinic acetylcholine receptor M1
Ligand
BDBM277268
Substrate
Meas. Tech.
In Vitro Cellular Assay
Temperature
298.15±n/a K
EC50
100±n/a nM
Comments
extracted
Citation
 Payne, ACastro Pineiro, JLBirch, LMKhan, ABraunton, AJKitulagoda, JESoejima, M 4-azaindole derivatives US Patent  US10072005 Publication Date 9/11/2018 
Target
Name:
Muscarinic acetylcholine receptor M1
Synonyms:
ACM1_HUMAN Cholinergic receptor, muscarinic 1 | Cholinergic, muscarinic M1
Type:
Protein
Mol. Mass.:
51442.54
Organism:
Homo sapiens (Human)
Description:
P11229
Residue:
460
  
Inhibitor
Name:
BDBM277268
Synonyms:
US10072005, Example 61
Type:
Small organic molecule
Emp. Form.:
C21H23ClN4O2
Mol. Mass.:
398.886
SMILES:
Cc1ccc(Cn2cc(C(=O)N[C@H]3CCCC[C@@H]3O)c3nccc(Cl)c23)nc1
: