Target
Muscarinic acetylcholine receptor M1
Ligand
BDBM277296
Substrate
Meas. Tech.
In Vitro Cellular Assay
Temperature
298.15±n/a K
EC50
251±n/a nM
Comments
extracted
Citation
 Payne, ACastro Pineiro, JLBirch, LMKhan, ABraunton, AJKitulagoda, JESoejima, M 4-azaindole derivatives US Patent  US10072005 Publication Date 9/11/2018 
Target
Name:
Muscarinic acetylcholine receptor M1
Synonyms:
ACM1_HUMAN Cholinergic receptor, muscarinic 1 | Cholinergic, muscarinic M1
Type:
Protein
Mol. Mass.:
51442.54
Organism:
Homo sapiens (Human)
Description:
P11229
Residue:
460
  
Inhibitor
Name:
BDBM277296
Synonyms:
US10072005, Example 89
Type:
Small organic molecule
Emp. Form.:
C20H19ClFN3O3
Mol. Mass.:
403.835
SMILES:
O[C@@H]1COCC[C@H]1NC(=O)c1cn(Cc2ccc(F)cc2)c2c(Cl)ccnc12
: