Target
Muscarinic acetylcholine receptor M4
Ligand
BDBM86057
Substrate
Ki
12±n/a nM
Comments
PDSP_3030
Citation
 Hameg, ABayle, FNuss, PDupuis, PGaray, RPDib, M Affinity of cyamemazine, an anxiolytic antipsychotic drug, for human recombinant dopamine vs. serotonin receptor subtypes. Biochem Pharmacol 65:435-40 (2003)  
Target
Name:
Muscarinic acetylcholine receptor M4
Synonyms:
ACM4_HUMAN Cholinergic, muscarinic M4 Muscarinic acetylcholine receptor M2 and M4
Type:
Enzyme Catalytic Domain
Mol. Mass.:
53079.31
Organism:
Homo sapiens (Human)
Description:
Cholinergic, muscarinic M4 CHRM4 HUMAN M3::P08173
Residue:
479
  
Inhibitor
Name:
BDBM86057
Synonyms:
CAS_62865 NSC_62865
Type:
Small organic molecule
Emp. Form.:
C19H21N3S
Mol. Mass.:
323.455
SMILES:
CC(CN(C)C)CN1c2ccccc2Sc2ccc(cc12)C#N
: